{"text_format":"1","workbook":"xlsx","n_sheets":11,"sheets":["Intro","Input","Output","Defaults","Calculations","Conc_sw","Crop parameters","SpERC details","Micro-nutrient endpoints","Biodegradation","References_cropconc"],"not_rendered":{"charts":1,"images":3,"macros":1,"external_links":1,"defined_names":343,"comments":2,"pivot_tables":0},"unopened":[],"bounds":{"document_bytes":16777216,"sheet_cells":100000,"rows_first":2000,"rows_last":500,"rows_between":2000,"halvings":0,"cell_chars":16384,"cell_head_chars":4096},"cells_cut":0,"cells_raw":0,"read":"whole","date_system":"1900"}

{"sheet":"Intro","index":0,"n_rows":83,"n_cols":8,"rows_kept":83,"cut":false,"hidden":false,"merged":[]}
[null,"FERTILIZER ENVIRONMENTAL EXPOSURE (FEE) TOOL"]
[null,"INTRODUCTION"]
[]
[]
[]
[]
[]
[]
[]
[]
[]
[]
[]
[]
[]
{"$rows_left_out":69}
{"sheet":"Input","index":1,"n_rows":52,"n_cols":6,"rows_kept":52,"cut":false,"hidden":false,"merged":[[7,4,7,5],[6,4,6,5],[3,2,3,3],[40,2,40,3],[40,1,41,1],[2,2,2,3],[10,2,10,3],[12,2,12,3],[11,2,11,3]]}
[null,"FERTILIZER ENVIRONMENTAL EXPOSURE (FEE) TOOL"]
[null,"INPUT"]
[null,"1.  Substance","-> Other"]
[null,"2.  Specific Environmental Release Category (SpERC)","SPERC 2: Outdoor use - direct application of solid or liquid fertilizers to soil; incorporation, placement, mixing, seed treatment, drip irrigation"]
[null,"3.  Single or multiple applications per growing season?","Single"]
[null,"     Total annual fertilizer use rate",300,"[kg/ha/year]",{"$f":"IF(AND(C5=\"Single\",Number_of_applications>1),\"ERROR: in case of more than 1 application per growing season select 'Multiple' at Step 3\",\" \")","v":" "}]
[null,{"$f":"IF(C5=\"Multiple\",\"     Number of applications\",\"\")","v":""},null,{"$f":"IF(C5=\"Multiple\",\"-\",\"\")","v":""},{"$f":"IF(AND(C5=\"Single\",Number_of_applications>1),\"ERROR: in case of single application, leave field empty or enter 1\",IF(AND(C5=\"Multiple\",Number_of_applications<2),\"ERROR: in case of multiple applications per growing season, value should be >1\",\" \"))","v":" "}]
[null,{"$f":"IF(C5=\"Multiple\",\"     Time between applications\",\"\")","v":""},null,{"$f":"IF(C5=\"Multiple\",\"[days]\",\"\")","v":""}]
[null,{"$f":"IF(C5=\"Multiple\",\"     Fertilizer use rate per application\",\"\")","v":""},{"$f":"IF(Single_Multi=\"Multiple\",APPL_rate_year/Number_of_applications,\"\")","v":""},{"$f":"IF(C5=\"Multiple\",\"[kg/ha]\",\"\")","v":""}]
[null,"4.  Refinement options",100,{"$f":"IF(Substance=\"-> Other\",\"Provide % available for runoff\",\"\")","v":"Provide % available for runoff"}]
[null,"     Crop type","Cereals, spring"]
[null,"     Crop growth stage (BBCH)","Bare soil, BBCH 00-09"]
[null,"     European crop yield scenario","Low"]
[null,"    Crop substance concentration",10,"[g/t]","not mandatory, only enter if specific data are available"]
[null,"    Crop yield",100,"[t/ha]","not mandatory, only enter if specific data are available"]
{"$rows_left_out":38}
{"sheet":"Output","index":2,"n_rows":35,"n_cols":13,"rows_kept":35,"cut":false,"hidden":false,"merged":[[20,2,20,7],[20,8,20,9],[20,10,20,11]]}
[null,"FERTILIZER ENVIRONMENTAL EXPOSURE (FEE) TOOL"]
[null,"OUTPUT"]
[]
[null,"Exposure scenario"]
[null,"Substance",{"$f":"Substance","v":"-> Other"}]
[null,"SpERC",{"$f":"SpERC","v":"SPERC 2: Outdoor use - direct application of solid or liquid fertilizers to soil; incorporation, placement, mixing, seed treatment, drip irrigation"}]
[null,"Application rate (total)",{"$f":"APPL_rate_year & \" \" & \"kg/ha/year\"","v":"300 kg/ha/year"}]
[null,"Number, timing applications",{"$f":"IF(Single_Multi=\"Single\",\"1 application\",Number_of_applications & \" applications, \" & Time_between_applications & \" days between applications\")","v":"1 application"}]
[null,"Crop type",{"$f":"Crop_choice","v":"Cereals, spring"}]
[null,"Crop growth stage",{"$f":"Crop_cover","v":"Bare soil, BBCH 00-09"}]
[null,"European crop yield scenario",{"$f":"Crop_quality","v":"Low"}]
[null,"Risk management measures",{"$f":"IF(Drift_M<>\"\",Drift_M&\"% drift reduction\",\"None\")","v":"None"}]
[]
[null,"Emission estimate"," [kg/ha]"," [%]"]
[null,"Volatilization",{"$f":"App_eq*Vol_perc/100","v":3},{"$f":"C15/$C$20*100","v":0.98684210526315785}]
{"$rows_left_out":21}
{"sheet":"Defaults","index":3,"n_rows":42,"n_cols":6,"rows_kept":42,"cut":false,"hidden":true,"merged":[[7,5,10,5]]}
[null,"FERTILIZER ENVIRONMENTAL EXPOSURE (FEE) TOOL"]
[null,"DEFAULTS"]
[]
[null,"Parameters","Value","Unit","Comments"]
[null,"Temperature (TEMP)",285,"°K","Table R.16-8 (12°C)"]
[null,"Depth (DEPTHsoil)",0.2,"m","Table R.16-15, agricultural soil"]
[null,"Depth soil runoff (DEPTHsoil_runoff)",0.02,"m","Worst-case assumption"]
[null,"Depth of the surface water (DEPTHwater)",0.3,"m","FOCUS Steps 1-2","Default scenario used:\n1 ha field, with surrounding shallow water body 1/10th of field size"]
[null,"Ratio field to water body (RATIO)",10,"-","FOCUS Steps 1-2"]
[null,"Density solid phase (RHOsolid)",2500,"kg/m3","Table R.16-8, general"]
[null,"Density water phase (RHOwater)",1000,"kg/m3","Table R.16-8, general"]
[null,"Density air (RHOair)",1.3,"kg/m3","Table R.16-8, general"]
[null,"Volume fraction water in soil (Fwater_soil)",0.2,"-","Table R.16-8, soil"]
[null,"Volume fraction air in soil (Fair_soil)",0.2,"-","Table R.16-8, soil"]
[null,"Volume fraction solids in soil (Fsolid_soil)",0.6,"-","Table R.16-8, soil"]
{"$rows_left_out":28}
{"sheet":"Calculations","index":4,"n_rows":78,"n_cols":5,"rows_kept":78,"cut":false,"hidden":true,"merged":[]}
[null,"FERTILIZER ENVIRONMENTAL EXPOSURE (FEE) TOOL"]
[null,"CALCULATIONS"]
[]
[null,"System properties","Value","Unit","Comments"]
[null,"Water solubility at 25°C",{"$f":"IF(SOL_M>0,SOL_M,SOL_D)","v":100},"mg/L","Select from input sheet"]
[null,"Henry coefficient (Henry)",{"$f":"IF(Henry_M>0,Henry_M,IF(Henry_D=0.000004,0.000004,IF(AND(MOLW_M>0,SOL_M>0,VP_M>0),(VP_M*MOLW_M/SOL_M))))","v":4.0000000000000004E-11},"Pa*m3/mol","Eqn R.16-4; calculated from mol.weight, solubility and vapour pressure if no Henry coefficient is provided"]
[null,"Partition coefficient solid-water in soil  (Kpsoil)",{"$f":"IF(Kpsoil_M>0,Kpsoil_M,IF(AND(Substance=\"-> Other\",Koc_M>0),(Koc_M*Foc_soil),Kpsoil_D))","v":0.2},"L/kg","Eqn R.16-6; calculated from Koc if no manual/default Kpsoil input data is provided"]
[null,"Kpsoil (Kpsoil_category)",{"$f":"IF(Kpsoil<=100,Biodegradation!C7,IF(Kpsoil<=1000,Biodegradation!C8,IF(Kpsoil<=10000,Biodegradation!C9,IF(Kpsoil<=100000,Biodegradation!C10))))","v":"Kp ≤ 100"},null,"Category selected based on data in Kpsoil"]
[null,"Biodegradation in soil (DT50soil_category)",{"$f":"IF(Substance=\"-> Other\",DT50_bio_soil_M,DT50_bio_soil_D)","v":"Readily biodegradable"},null,"Select from input sheet"]
[null,"Biodegradation in soil (DT50_soil)",{"$f":"IF(AND(Substance=\"-> Other\",Half_life_soil_M>0),Half_life_soil_M,IF(AND(Substance=\"-> Other\",Kpsoil_M=0),\"Provide manual input (DT50 or Kpsoil)\",VLOOKUP(Kpsoil_category,Biodegradation!C6:G10,MATCH(DT50soil_category,Biodegradation!C6:G6,FALSE),FALSE)))","v":5},"days","Lookup table"]
[null,"Biodegradation in water (DT50_water)",{"$f":"IF(AND(Substance=\"-> Other\",DT50bio_water_sed_M>0),DT50bio_water_sed_M,IF(Substance=\"-> Other\",\"Provide manual input\",VLOOKUP(Biodegradation!C11,Biodegradation!C6:G11,MATCH(DT50soil_category,Biodegradation!C6:G6,FALSE),FALSE)))","v":30},"days","Lookup table"]
[null,"Partition coefficient solid-water of susp. matter (Kpsusp)",{"$f":"IF(Kpsusp_M>0,Kpsusp_M,IF(AND(Substance=\"-> Other\",Koc_M>0),(Koc_M*Foc_susp),Kpsusp_D))","v":1},"L/kg","Eqn R.16-6; calculated from Koc if no manual/default Kpsusp input data is provided"]
[null,"Kair_water",{"$f":"Henry/8.314/TEMP","v":1.6881269809115043E-14},"-","Eqn R.16-5"]
[null,"Ksoil_water",{"$f":"Fair_soil*Kair_water+Fwater_soil+Fsolid_soil*Kpsoil/1000*RHOsolid","v":0.50000000000000333},"m3/m3","Eqn R.16-7"]
[null,"Ksusp_water",{"$f":"Fwater_susp+Fsolid_susp*Kpsusp/1000*RHOsolid","v":1.1499999999999999},"m3/m3","Eqn R.16-7"]
{"$rows_left_out":64}
{"sheet":"Conc_sw","index":5,"n_rows":106,"n_cols":12,"rows_kept":106,"cut":false,"hidden":true,"merged":[]}
[null,"FERTILIZER ENVIRONMENTAL EXPOSURE (FEE) TOOL"]
[null,"EXPOSURE SURFACE WATER"]
[]
[null,"Input parameters",null,null,null,null,"Conc surface water calculations"]
[null,"Input runoff [mg/m2]","Input drift [mg/m2]","Total input [µg/L]","Csurface water [µg/L]",null,"Day no","Input runoff [mg/m2]","Input drift [mg/m2]","Total input [µg/L]","Total input incl removal [µg/L]","Csurface water [µg/L]"]
[null,{"$f":"App_eq_soil*Runoff_perc*RATIO","v":300000},{"$f":"App_eq*Drift_perc","v":0},{"$f":"(Input_runoff+Input_drift)/DEPTHwater","v":1000000},{"$f":"IF((Input_sw)/(1+Kpsusp*SUSPwater*0.000001)<(SOL*1000),(Input_sw)/(1+Kpsusp*SUSPwater*0.000001),(SOL*1000))","v":100000},null,0,{"$f":"IF(G6=((Time_between_applications*(Number_of_applications-1))+4),Input_runoff,0)","v":0},{"$f":"Input_drift","v":0},{"$f":"(H6+I6)/DEPTHwater","v":0},{"$f":"J6*EXP(-ktotal_water*G6)","v":0},{"$f":"IF((K6)/(1+Kpsusp*SUSPwater*0.000001)<(SOL*1000),(K6)/(1+Kpsusp*SUSPwater*0.000001),(SOL*1000))","v":0}]
[null,null,null,null,null,null,1,0,{"$f":"IF(Single_Multi=\"Single\",0,IF(AND(MOD(G7/Time_between_applications,1)=0,OR((Conc_sw!G7<Conc_sw!$C$10),(Conc_sw!G7=Conc_sw!$C$10))),Input_drift,0))","v":0},0,{"$f":"(J7+K6)*EXP(-ktotal_water*$G$7)","v":0},0]
[null,null,null,null,null,null,2,0,{"$f":"IF(Single_Multi=\"Single\",0,IF(AND(MOD(G8/Time_between_applications,1)=0,OR((Conc_sw!G8<Conc_sw!$C$10),(Conc_sw!G8=Conc_sw!$C$10))),Input_drift,0))","v":0},0,0,0]
[null,null,null,null,null,null,3,0,{"$f":"IF(Single_Multi=\"Single\",0,IF(AND(MOD(G9/Time_between_applications,1)=0,OR((Conc_sw!G9<Conc_sw!$C$10),(Conc_sw!G9=Conc_sw!$C$10))),Input_drift,0))","v":0},0,0,0]
[null,"Maximum days",{"$f":"Time_between_applications*(Number_of_applications-1)","v":0},null,null,null,4,300000,{"$f":"IF(Single_Multi=\"Single\",0,IF(AND(MOD(G10/Time_between_applications,1)=0,OR((Conc_sw!G10<Conc_sw!$C$10),(Conc_sw!G10=Conc_sw!$C$10))),Input_drift,0))","v":0},1000000,953033.80285121279,100000]
[null,null,null,null,null,null,5,0,{"$f":"IF(Single_Multi=\"Single\",0,IF(AND(MOD(G11/Time_between_applications,1)=0,OR((Conc_sw!G11<Conc_sw!$C$10),(Conc_sw!G11=Conc_sw!$C$10))),Input_drift,0))","v":0},0,908273.42937704432,100000]
[null,null,null,null,null,null,6,0,{"$f":"IF(Single_Multi=\"Single\",0,IF(AND(MOD(G12/Time_between_applications,1)=0,OR((Conc_sw!G12<Conc_sw!$C$10),(Conc_sw!G12=Conc_sw!$C$10))),Input_drift,0))","v":0},0,865615.28042791691,100000]
[null,null,null,null,null,null,7,0,{"$f":"IF(Single_Multi=\"Single\",0,IF(AND(MOD(G13/Time_between_applications,1)=0,OR((Conc_sw!G13<Conc_sw!$C$10),(Conc_sw!G13=Conc_sw!$C$10))),Input_drift,0))","v":0},0,824960.62251233659,100000]
[null,null,null,null,null,null,8,0,{"$f":"IF(Single_Multi=\"Single\",0,IF(AND(MOD(G14/Time_between_applications,1)=0,OR((Conc_sw!G14<Conc_sw!$C$10),(Conc_sw!G14=Conc_sw!$C$10))),Input_drift,0))","v":0},0,786215.35927543591,100000]
[null,null,null,null,null,null,9,0,{"$f":"IF(Single_Multi=\"Single\",0,IF(AND(MOD(G15/Time_between_applications,1)=0,OR((Conc_sw!G15<Conc_sw!$C$10),(Conc_sw!G15=Conc_sw!$C$10))),Input_drift,0))","v":0},0,749289.81371030118,100000]
{"$rows_left_out":92}
{"sheet":"Crop parameters","index":6,"n_rows":46,"n_cols":14,"rows_kept":46,"cut":false,"hidden":true,"merged":[[3,4,3,6],[6,4,6,6],[38,4,38,6],[3,7,3,9],[38,10,38,11],[3,10,3,13],[4,10,5,10],[4,11,5,11],[4,12,5,12],[4,13,5,13]]}
[null,"FERTILIZER ENVIRONMENTAL EXPOSURE (FEE) TOOL"]
[null,"CROP PARAMETERS"]
[]
[null,null,null,null,"Micronutrient concentration **",null,null,"Crop Yield (ww) ***",null,null,"Crop growth stage (BBCH codes) [% crop interception] ****"]
[null,"Crop","References","Drift percentage *","Copper","Manganese","Zinc","Low","High","Medium","Bare soil, BBCH 00-09","Minimal crop cover, BBCH 10-19","Intermediate crop cover, BBCH 20-39","Full canopy, BBCH 40-89"]
[null,null,null,"[%]","[g/t]","[g/t]","[g/t]","[t/ha/y]","[t/ha/y]","[t/ha/y]"]
[null,"SPERC 1: Outdoor use - direct application of solid fertilizers to soil; surface spreading",null,0,null,null,null,null,null,null,0,10,25,40]
[null,"SPERC 2: Outdoor use - direct application of solid or liquid fertilizers to soil; incorporation, placement, mixing, seed treatment, drip irrigation",null,0,null,null,null,null,null,null,0,0,0,0]
[null,"SPERC 3: Outdoor use - application of fertilizers by helicopter",null,33.200000000000003,null,null,null,null,null,null,0,20,50,70]
[null,"SPERC 4: Outdoor use - spray application of liquid fertilizers; soil surface spreading, sprinkler, pivot, foliar spray, slurry",null,15.725,null,null,null,null,null,null,0,20,40,65]
[null,"Generic crop"]
[null,"---------"]
[null,"Cereals, spring","13, 18",2.7589999999999999,11,31,24.666666666666668,1.86,6.4640000000000004,3.5239000000000003,0,0,20,70]
[null,"Cereals, winter","13, 18, 20",2.7589999999999999,11,21.143333333333334,24,1.2767500000000001,8.0313333333333343,4.1634166666666665,0,0,20,70]
[null,"Citrus","8, 10, 16, 18",15.725,0.53,0.5625,0.85,8.8338640090749667,43.247496121938511,20.264226552337071,0,80,80,80]
{"$rows_left_out":32}
{"sheet":"SpERC details","index":7,"n_rows":19,"n_cols":8,"rows_kept":19,"cut":false,"hidden":true,"merged":[]}
[null,"FERTILIZER ENVIRONMENTAL EXPOSURE (FEE) TOOL"]
[null,"SPERC DETAILS"]
[]
[null,"Runoff scenario","% runoff 30 days",null,"Vapour pressure","Volatilization (%)"]
[null,"SPERC 1: Outdoor use - direct application of solid fertilizers to soil; surface spreading",{"$f":"Ksoil_water_runoff*30*100","v":158.71190931822917},null,"Default (inorganics)",0,null,"Single"]
[null,"SPERC 2: Outdoor use - direct application of solid or liquid fertilizers to soil; incorporation, placement, mixing, seed treatment, drip irrigation",0,null,"< 0.01 mPa",1,null,"Multiple"]
[null,"SPERC 3: Outdoor use - application of fertilizers by helicopter",{"$f":"Ksoil_water_runoff*30*100","v":158.71190931822917},null,"0.01 - 0.1 mPa",10]
[null,"SPERC 4: Outdoor use - spray application of liquid fertilizers; soil surface spreading, sprinkler, pivot, foliar spray, slurry",{"$f":"Ksoil_water_runoff*30*100","v":158.71190931822917},null,"0.1 - 1 mPa",20,null,50]
[null,null,null,null,"1 - 10 mPa",50,null,75]
[null,null,null,null,"> 10 mPa",100,null,90]
[]
[]
[]
[]
[]
{"$rows_left_out":5}
{"sheet":"Micro-nutrient endpoints","index":8,"n_rows":18,"n_cols":16,"rows_kept":18,"cut":false,"hidden":true,"merged":[]}
[null,"FERTILIZER ENVIRONMENTAL EXPOSURE (FEE) TOOL"]
[null,"MICRO-NUTRIENT STANDARD PARAMETERS"]
[]
[null,"Micro-nutrient *",null,"Substance properties",null,null,null,null,null,"Exposure assessment (PEC regional)",null,null,null,"Effect assessment"]
[null,null,null,"Molecular weight \n[g/mol]","Solubility at 25°C [mg/L] **","Vapour pressure at 25°C [Pa] **","Henry coefficient [Pa*m3/mol] *","Kpsoil [L/kg dw]","Kp susp matter [L/kg dw]","PEC soil [mg/kg dw] ***","PEC freshwater [µg/L]","PEC sediment [mg/kg dw]","Added/total approach","PNEC soil [mg/kg dw]","PNEC freshwater [µg/L]","PNEC sediment [mg/kg dw]"]
[null,"Copper","Cu",63.55,100,9.9999999999999995E-7,3.9999999999999998E-6,2120,30246,14,2.9,67.5,"TOTAL",65,7.8,87]
[null,"Manganese","Mn",54.94,100,9.9999999999999995E-7,3.9999999999999998E-6,1355,{"$f":"POWER(10,4.45)","v":28183.829312644593},0,0,0,"ADDED",12.4,12.8,36.1]
[null,"Zinc","Zn",65.38,100,9.9999999999999995E-7,3.9999999999999998E-6,158.5,110000,41.3,3.4,45,"ADDED",107,20.6,235.6]
[null,"-> Other",null,"Provide manual input","Provide manual input","Provide manual input","Provide manual input (or enter mol.weight, solubility and vapour pressure)","Provide manual input for Kpsoil or Koc","Provide manual input","Provide manual input","Provide manual input","Provide manual input",null,"Provide manual input","Provide manual input","Provide manual input"]
[null,"* Unless otherwise stated, micro-nutrient properties are based on information from the REACH dissemination website; please check carefully for consistency with most recent dossier information"]
[null,"** Default values for inorganics from R7-13-2 Information requirements, metals"]
[null,"*** PEC soil regional selected from GEMAS dataset"]
[]
[]
[]
{"$rows_left_out":4}
{"sheet":"Biodegradation","index":9,"n_rows":18,"n_cols":7,"rows_kept":18,"cut":false,"hidden":true,"merged":[[5,1,9,1]]}
[null,null,"FERTILIZER ENVIRONMENTAL EXPOSURE (FEE) TOOL"]
[null,null,"BIODEGRADATION IN SOIL AND SURFACE WATER"]
[]
[null,null,"Half-lives (days) based on results from standardised biodegradation screening tests *"]
[]
[null,"SOIL","Kpsoil (L/kg)","Not biodegradable","Readily biodegradable","Readily biodegradable, failing 10-d window ","Inherently biodegradable"]
[null,null,"Kp ≤ 100",1000000,30,90,300]
[null,null,"Kp 100 - 1000",1000000,300,900,3000]
[null,null,"Kp 1000 - 10000",1000000,3000,9000,30000]
[null,null,"Kp 10000 - 100000",1000000,30000,90000,300000]
[null,null,"SURFACE WATER",1000000,15,50,150]
[]
[null,null,"* Table adapted from REACH guidance R.16, Table R.16-12 (soil) and Table R.16-11 (surface water)"]
[]
[]
{"$rows_left_out":4}
{"sheet":"References_cropconc","index":10,"n_rows":22,"n_cols":6,"rows_kept":22,"cut":false,"hidden":false,"merged":[]}
["Reference #","Author(s)","Year","Title","Journal/Book/Website","Publisher"]
[1,"Andrioli, F.F. et al.",2008,"Curve of growth and uptake for the garlic crop under field conditions","Scientia Agraria 9(3): 385-393;\nhttp://revistas.ufpr.br/agraria/article/view/11538"]
[2,"Aydinalp, C. & Marinova, S.",2012,"Concentration of Cu and Zn in some fruits and vegetables grown in Northwestern Turkey","Bulgarian Journal of Agricultural Science 18(5): 749-751;\nhttp://www.agrojournal.org/18/05-15-12.pdf"]
[3,"Beiss, U.",1978,"Sugar Beet - Nutritional Summary","http://www.yara.co.uk/crop-nutrition/crops/sugarbeet/key-facts/sugar-beet-nutritional-summary/","Yara, United Kingdom"]
[4,"Bozkurt, M.A. et al.",2010,"The Use of Sewage Sludge as an Organic Matter Source in Apple Trees","Polish Journal of Environmental Studies 19(2): 267-274;\nhttp://www.pjoes.com/pdf/19.2/267-274.pdf"]
[5,"Cadenas Caro, F.I.",2013,"Effect of different crop loads on mineral element distribution in different organs of the olive tree at harvest","pp. 64;\nhttp://repositorio.uchile.cl/handle/2250/116066","Universidad de Chile, Facultad de Ciencias Agronomicas Escuela de Pregrado, Chile"]
[6,"Ferguson, R.B. et al.",2006,"G87-859 Fertilizer Recommendations for Soybean (Revised August 2006)","Historical Materials from University of Nebraska-Lincoln Extension, paper 1714\nhttp://digitalcommons.unl.edu/cgi/viewcontent.cgi?article=2712&context=extensionhist","University of Nebraska, Lincoln, United States"]
[7,"Heard, J. & Hay, D.",2006,"Nutrient Content, Uptake Pattern and Carbon:Nitrogen Ratios of Prairie Crops","Proceedings of the 7th Annual Manitoba Agronomists Conference. http://umanitoba.ca/faculties/afs/MAC_proceedings/proceedings/2006/heard_hay_nutrient_uptake.pdf","University of Manitoba, Canada"]
[8,"Labanauskas, C.K. & Handy, M.F.",1972,"Nutrient removal by Valencia orange fruit from citrus orchards in California","California Agriculture, Dec 1972; \nhttps://ucanr.edu/repositoryfiles/ca2612p3-63995.pdf","University of California, Division of Agricultural Sciences, United States"]
[9,"Lehnert, R.",2010,"Nutrient needs by apple trees","http://www.goodfruit.com/nutrient-needs-by-apple-trees/","Washington State Fruit Commission, United States"]
[10,"Mattos Jr., D. et al.",2003,"Nutrient content of biomass components of Hamlin sweet orange trees","Scientia Agricola 60(1): 155-160; \nhttp://www.scielo.br/pdf/sa/v60n1/14557.pdf"]
[11,"Mitchell, C.C.",2011,"Nutrient Removal by Alabama Crops","ANR-0449; \nhttp://www.aces.edu/pubs/docs/A/ANR-0449/ANR-0449.pdf","Alabama Cooperative Extension System, Alabama A&M University and Auburn University, United States"]
[12,"Nour, V. et al.",2010,"Compositional Characteristics of Fruits of several Apple (Malus domestica Borkh.) Cultivars ","Notulae Botanicae Horti Agrobotanici Cluj-Napoca 38(3): 228-233; \nhttp://www.notulaebotanicae.ro/index.php/nbha/article/view/4762/5097"]
[13,"Osmond, D.L. & Kang, J.",2008,"Soil facts, Nutrient Removal by Crops in North Carolina","https://content.ces.ncsu.edu/nutrient-removal-by-crops-in-north-carolina","North Carolina State University and North Carolina Cooperative Extension Service, United States"]
[14,"Portner, J., Roßbauer, G., Bauer, M.",2006,"Nährstoffaufnahme des Hopfens (in German)","Hopfen-Rundschau 5: 116-120; https://www.lfl.bayern.de/mam/cms07/ipz/dateien/artikelnaehrstoffaufnahme.pdf","Bayerische Landesanstalt für Landwirtschaft, Germany"]
{"$rows_left_out":7}